After loplugin:staticvar in sw, Jenkins_Windows_Dbg failing

classic Classic list List threaded Threaded
2 messages Options
slacka slacka
Reply | Threaded
Open this post in threaded view
|

After loplugin:staticvar in sw, Jenkins_Windows_Dbg failing

After https://cgit.freedesktop.org/libreoffice/core/commit/?id=4ba5b003b594f9eb6c9b185208bdb72aef8273d0
loplugin:staticvar in sw

 Jenkins_Windows_Dbg failing with

9  NEXT    C:/cygwin/home/tdf/lode/jenkins/workspace/lo_tb_master_win_dbg/sw/source/filter/html/svxcss1.cxx(3166): error C2065: ´CSS1PropEntryCompare´: undeclared identifier
7049  NEXT    make: *** [Makefile:286: build] Error 2

https://tinderbox.libreoffice.org/cgi-bin/gunzip.cgi?tree=MASTER&brief-log=1540039069.23076
_______________________________________________
LibreOffice mailing list
[hidden email]
https://lists.freedesktop.org/mailman/listinfo/libreoffice
Noel Grandin-2 Noel Grandin-2
Reply | Threaded
Open this post in threaded view
|

Re: After loplugin:staticvar in sw, Jenkins_Windows_Dbg failing

I had a fix in progress, but I see sberg beat me to it with 

c0dcf426d258bc0b605b4097833729eb9ed05025
:-)

On Sat, 20 Oct 2018 at 18:18, Luke Benes <[hidden email]> wrote:
After https://cgit.freedesktop.org/libreoffice/core/commit/?id=4ba5b003b594f9eb6c9b185208bdb72aef8273d0
loplugin:staticvar in sw

 Jenkins_Windows_Dbg failing with

9  NEXT    C:/cygwin/home/tdf/lode/jenkins/workspace/lo_tb_master_win_dbg/sw/source/filter/html/svxcss1.cxx(3166): error C2065: ´CSS1PropEntryCompare´: undeclared identifier
7049  NEXT    make: *** [Makefile:286: build] Error 2

https://tinderbox.libreoffice.org/cgi-bin/gunzip.cgi?tree=MASTER&brief-log=1540039069.23076
_______________________________________________
LibreOffice mailing list
[hidden email]
https://lists.freedesktop.org/mailman/listinfo/libreoffice

_______________________________________________
LibreOffice mailing list
[hidden email]
https://lists.freedesktop.org/mailman/listinfo/libreoffice