Building failed: "testN777345::Import equality assertion failed"

classic Classic list List threaded Threaded
3 messages Options
Mickael Jackson Mickael Jackson
Reply | Threaded
Open this post in threaded view
|

Building failed: "testN777345::Import equality assertion failed"

After 6 hours of building, it ends with a failure...

(cppunittester:32480): Gdk-WARNING **: 16:30:37.605: gdk_window_set_icon_list: icons too large
image-hyperlink.docx:
116
testImageHyperlink::Import finished in: 125ms
ooxmlimport.cxx:405:Assertion
Test name: testN777345::Import
equality assertion failed
- Expected: 15258412514674086030
- Actual  : 7550566848119649750

Failures !!!
Run: 80   Failure total: 1   Failures: 1   Errors: 0
which: no gdb in (/home/linuxyz/Documents:/home/linuxyz/backup_ln/PROGRAMS/ANDROID/.repo:/home/linuxyz/backup_ln/PROGRAMS/ANDROID/lineageOS:/home/linuxyz/backup_ln/PROGRAMS/ANDROID/platform-tools:/usr/local/bin:/usr/bin:/bin:/usr/local/sbin:/usr/lib/jvm/default/bin:/usr/bin/site_perl:/usr/bin/vendor_perl:/usr/bin/core_perl)
You need gdb in your path to show backtraces

Error: a unit test failed, please do one of:

make CppunitTest_sw_ooxmlimport CPPUNITTRACE="gdb --args"
    # for interactive debugging on Linux
make CppunitTest_sw_ooxmlimport VALGRIND=memcheck
    # for memory checking
make CppunitTest_sw_ooxmlimport DEBUGCPPUNIT=TRUE
    # for exception catching

You can limit the execution to just one particular test by:

make CPPUNIT_TEST_NAME="testXYZ" ...above mentioned params...

make[1]: *** [/home/linuxyz/Documents/libreoffice_src/solenv/gbuild/CppunitTest.mk:113: /home/linuxyz/Documents/libreoffice_src/workdir/CppunitTest/sw_ooxmlimport.test] Error 1
make: *** [Makefile:282: build] Error 2

I've runned before:

$ ./autogen.sh --without-junit

than

$ make

Any idea what's happened? Thanks a lot in advance!

--
To unsubscribe e-mail to: [hidden email]
Problems? https://www.libreoffice.org/get-help/mailing-lists/how-to-unsubscribe/
Posting guidelines + more: https://wiki.documentfoundation.org/Netiquette
List archive: https://listarchives.libreoffice.org/global/users/
Privacy Policy: https://www.documentfoundation.org/privacy
Mickael Jackson Mickael Jackson
Reply | Threaded
Open this post in threaded view
|

Re: Building failed: "testN777345::Import equality assertion failed"

My system:

Arch Linux

Kernel 4.19.12-2

On 28/12/2018 07:34, Mickael Jackson wrote:

> After 6 hours of building, it ends with a failure...
>
> (cppunittester:32480): Gdk-WARNING **: 16:30:37.605: gdk_window_set_icon_list: icons too large
> image-hyperlink.docx:
> 116
> testImageHyperlink::Import finished in: 125ms
> ooxmlimport.cxx:405:Assertion
> Test name: testN777345::Import
> equality assertion failed
> - Expected: 15258412514674086030
> - Actual  : 7550566848119649750
>
> Failures !!!
> Run: 80   Failure total: 1   Failures: 1   Errors: 0
> which: no gdb in (/home/linuxyz/Documents:/home/linuxyz/backup_ln/PROGRAMS/ANDROID/.repo:/home/linuxyz/backup_ln/PROGRAMS/ANDROID/lineageOS:/home/linuxyz/backup_ln/PROGRAMS/ANDROID/platform-tools:/usr/local/bin:/usr/bin:/bin:/usr/local/sbin:/usr/lib/jvm/default/bin:/usr/bin/site_perl:/usr/bin/vendor_perl:/usr/bin/core_perl)
> You need gdb in your path to show backtraces
>
> Error: a unit test failed, please do one of:
>
> make CppunitTest_sw_ooxmlimport CPPUNITTRACE="gdb --args"
>      # for interactive debugging on Linux
> make CppunitTest_sw_ooxmlimport VALGRIND=memcheck
>      # for memory checking
> make CppunitTest_sw_ooxmlimport DEBUGCPPUNIT=TRUE
>      # for exception catching
>
> You can limit the execution to just one particular test by:
>
> make CPPUNIT_TEST_NAME="testXYZ" ...above mentioned params...
>
> make[1]: *** [/home/linuxyz/Documents/libreoffice_src/solenv/gbuild/CppunitTest.mk:113: /home/linuxyz/Documents/libreoffice_src/workdir/CppunitTest/sw_ooxmlimport.test] Error 1
> make: *** [Makefile:282: build] Error 2
>
> I've runned before:
>
> $ ./autogen.sh --without-junit
>
> than
>
> $ make
>
> Any idea what's happened? Thanks a lot in advance!
>

--
To unsubscribe e-mail to: [hidden email]
Problems? https://www.libreoffice.org/get-help/mailing-lists/how-to-unsubscribe/
Posting guidelines + more: https://wiki.documentfoundation.org/Netiquette
List archive: https://listarchives.libreoffice.org/global/users/
Privacy Policy: https://www.documentfoundation.org/privacy
Regina Henschel Regina Henschel
Reply | Threaded
Open this post in threaded view
|

Re: Building failed: "testN777345::Import equality assertion failed"

In reply to this post by Mickael Jackson
Hi Mickael,

Mickael Jackson schrieb am 28-Dec-18 um 07:34:

> After 6 hours of building, it ends with a failure...
>
> (cppunittester:32480): Gdk-WARNING **: 16:30:37.605: gdk_window_set_icon_list: icons too large
> image-hyperlink.docx:
> 116
> testImageHyperlink::Import finished in: 125ms
> ooxmlimport.cxx:405:Assertion
> Test name: testN777345::Import
> equality assertion failed
> - Expected: 15258412514674086030
> - Actual  : 7550566848119649750

I saw your mail already on the dev mailing list, but I'm not familiar
with Linux. You can build for now with make build-nocheck. And after the
holidays you should discuss the problem with the senior developers on IRC.

Kind regards
Regina

--
To unsubscribe e-mail to: [hidden email]
Problems? https://www.libreoffice.org/get-help/mailing-lists/how-to-unsubscribe/
Posting guidelines + more: https://wiki.documentfoundation.org/Netiquette
List archive: https://listarchives.libreoffice.org/global/users/
Privacy Policy: https://www.documentfoundation.org/privacy